Reaction Details
TargetMuscarinic acetylcholine receptor M1
LigandBDBM50015727
Substrate/Competitorn/a
Meas. Tech.ChEBML_138933
Kd 1.1±n/a nM
Citation Cereda, EEzhaya, AGil Quintero, MBellora, EDubini, EMicheletti, RSchiavone, ABrambilla, ASchiavi, GBDonetti, A Synthesis and biological evaluation of new antimuscarinic compounds with amidine basic centers. A useful bioisosteric replacement of classical cationic heads. J Med Chem33:2108-13 (1990) Muscarinic acetylcholine receptor M1
Name:Muscarinic acetylcholine receptor M1
Type:Enzyme Catalytic Domain
Mol. Mass.:51390.46
Organism:RAT
Description:P08482
Residue:460
BDBM50015727
NameBDBM50015727
Synonyms:7-(3-Hydroxy-2-phenyl-propionyloxy)-9,9-dimethyl-3-oxa-9-azonia-tricyclo[3.3.1.0*2,4*]nonane; bromide(scopolamine methyl bromide) | CHEMBL293927
TypeSmall organic molecule
Emp. Form.C18H24NO4
Mol. Mass.318.3869
SMILESC[N+]1(C)C2CC(CC1C1OC21)OC(=O)C(CO)c1ccccc1