Reaction Details
TargetMuscarinic acetylcholine receptor M1
LigandBDBM50015726
Substrate/Competitorn/a
Meas. Tech.ChEBML_138933
Kd 7.5±n/a nM
Citation Cereda, EEzhaya, AGil Quintero, MBellora, EDubini, EMicheletti, RSchiavone, ABrambilla, ASchiavi, GBDonetti, A Synthesis and biological evaluation of new antimuscarinic compounds with amidine basic centers. A useful bioisosteric replacement of classical cationic heads. J Med Chem33:2108-13 (1990) Muscarinic acetylcholine receptor M1
Name:Muscarinic acetylcholine receptor M1
Type:Enzyme Catalytic Domain
Mol. Mass.:51390.46
Organism:RAT
Description:P08482
Residue:460
BDBM50015726
NameBDBM50015726
Synonyms:3-Hydroxy-2-phenyl-propionic acid 9-carbamimidoyl-3-oxa-9-aza-tricyclo[3.3.1.0*2,4*]non-7-yl ester; hydrochloride | CHEMBL553562
TypeSmall organic molecule
Emp. Form.C17H21N3O4
Mol. Mass.331.3663
SMILESNC(=N)N1C2CC(CC1C1OC21)OC(=O)C(CO)c1ccccc1