Reaction Details
TargetMu-type opioid receptor
LigandBDBM50013766
Substrate/Competitorn/a
Meas. Tech.ChEBML_146692
IC50 323±n/a nM
Citation Klein, PNelson, WLYao, YHSimon, EJ Electrophilic alpha-methylene-gamma-lactone and isothiocyanate opioid ligands related to etorphine. J Med Chem33:2286-96 (1990) Mu-type opioid receptor
Name:Mu-type opioid receptor
Type:Enzyme Catalytic Domain
Mol. Mass.:45038.37
Organism:CALF
Description:OPIATE Mu 2 0 CALF::P79350
Residue:401
BDBM50013766
NameBDBM50013766
Synonyms:(S)-1-(11,15-dimethoxy-3-methyl-13-oxa-3-azahexacyclo[13.2.2.12,8.01,6.06,14.07,12]icosa-7,9,11,18-tetraen-16-yl)ethyl isothiocyanate | CHEMBL3038195
TypeSmall organic molecule
Emp. Form.C24H28N2O3S
Mol. Mass.424.556
SMILES[H][C@@]12Oc3c4c(C[C@@]5([H])N(C)CC[C@@]14[C@]51CC([C@H](C)N=C=S)[C@]2(OC)C=C1)ccc3OC