Reaction Details
TargetMu-type opioid receptor
LigandBDBM50013768
Substrate/Competitorn/a
Meas. Tech.ChEBML_146692
IC50 34±n/a nM
Citation Klein, PNelson, WLYao, YHSimon, EJ Electrophilic alpha-methylene-gamma-lactone and isothiocyanate opioid ligands related to etorphine. J Med Chem33:2286-96 (1990) Mu-type opioid receptor
Name:Mu-type opioid receptor
Type:Enzyme Catalytic Domain
Mol. Mass.:45038.37
Organism:CALF
Description:OPIATE Mu 2 0 CALF::P79350
Residue:401
BDBM50013768
NameBDBM50013768
Synonyms:3-O-(tert-Butyldimethylsilyl)-6,14-endo-etheno-7alpha-(3-carboxy-3-n-butenyl) tetrahydrooripavine gama-Lactone | CHEMBL3038193
TypeSmall organic molecule
Emp. Form.C31H41NO5Si
Mol. Mass.535.7464
SMILES[H][C@@]1(CC(=C)C(=O)O1)[C@@]1([H])C[C@]23C=C[C@]1(OC)[C@]1([H])Oc4c5c(C[C@@]2([H])N(C)CC[C@@]315)ccc4O[Si](C)(C)C(C)(C)C