Reaction Details
TargetD(2) dopamine receptor
LigandBDBM50001955
Substrate/Competitorn/a
Meas. Tech.ChEBML_58703
IC50 70±n/a nM
Citation Claudi, FCardellini, MCingolani, GMPiergentili, APeruzzi, GBalduini, W Synthesis and dopamine receptor affinities of 2-(4-fluoro-3- hydroxyphenyl)ethylamine and N-substituted derivatives. J Med Chem33:2408-12 (1990) D(2) dopamine receptor
Name:D(2) dopamine receptor
Type:G Protein-Coupled Receptor (GPCR)
Mol. Mass.:50931.60
Organism:Rattus norvegicus (rat)
Description:P61169
Residue:444
BDBM50001955
NameBDBM50001955
Synonyms:(-)6-Methyl-5,6,6a,7-tetrahydro-4H-dibenzo[de,g]quinoline-10,11-diol(APO) (R)-6-Methyl-5,6,6a,7-tetrahydro-4H-dibenzo[de,g]quinoline-10,11-diol ((R)-apomorphine) (R)-6-Methyl-5,6,6a,7-tetrahydro-4H-dibenzo[de,g]quinoline-10,11-diol(apomorphine) 6-Methyl-5,6,6a,7-tetrahydro-4H-dibenzo[de,g]quinoline-10,11-diol 6-Methyl-5,6,6a,7-tetrahydro-4H-dibenzo[de,g]quinoline-10,11-diol((R)-apomorphine) APOMORPHINE APOMORPHINE6-Methyl-5,6,6a,7-tetrahydro-4H-dibenzo[de,g]quinoline-10,11-diol | CHEMBL53
TypeSmall organic molecule
Emp. Form.C17H17NO2
Mol. Mass.267.3224
SMILESCN1CCc2cccc-3c2[C@H]1Cc1ccc(O)c(O)c-31