Reaction Details
TargetSigma non-opioid intracellular receptor 1
LigandBDBM50010758
Substrate/Competitorn/a
Meas. Tech.ChEMBL_201266 (CHEMBL804883)
IC50 14±n/a nM
Citation Scherz, MWFialeix, MFischer, JBReddy, NLServer, ACSonders, MSTester, BCWeber, EWong, STKeana, JF Synthesis and structure-activity relationships of N,N'-di-o-tolylguanidine analogues, high-affinity ligands for the haloperidol-sensitive sigma receptor. J Med Chem33:2421-9 (1990) Sigma non-opioid intracellular receptor 1
Name:Sigma non-opioid intracellular receptor 1
Type:Enzyme Catalytic Domain
Mol. Mass.:25124.85
Organism:Homo sapiens (Human)
Description:Q99720
Residue:223
BDBM50010758
NameBDBM50010758
Synonyms:CHEMBL312600 | N,N'-Bis-(2-iodo-phenyl)-guanidine
TypeSmall organic molecule
Emp. Form.C13H11I2N3
Mol. Mass.463.0555
SMILESNC(Nc1ccccc1I)=Nc1ccccc1I