Reaction Details
TargetSigma non-opioid intracellular receptor 1
LigandBDBM50010779
Substrate/Competitorn/a
Meas. Tech.ChEMBL_201266 (CHEMBL804883)
IC50 4±n/a nM
Citation Scherz, MWFialeix, MFischer, JBReddy, NLServer, ACSonders, MSTester, BCWeber, EWong, STKeana, JF Synthesis and structure-activity relationships of N,N'-di-o-tolylguanidine analogues, high-affinity ligands for the haloperidol-sensitive sigma receptor. J Med Chem33:2421-9 (1990) Sigma non-opioid intracellular receptor 1
Name:Sigma non-opioid intracellular receptor 1
Type:Enzyme Catalytic Domain
Mol. Mass.:25124.85
Organism:Homo sapiens (Human)
Description:Q99720
Residue:223
BDBM50010779
NameBDBM50010779
Synonyms:CHEMBL310003 | N-Bicyclo[2.2.1]hept-2-yl-N'-(2-iodo-phenyl)-guanidine
TypeSmall organic molecule
Emp. Form.C14H18IN3
Mol. Mass.355.2173
SMILESNC(Nc1ccccc1I)=NC1CC2CCC1C2