Reaction Details
TargetSigma non-opioid intracellular receptor 1
LigandBDBM50010764
Substrate/Competitorn/a
Meas. Tech.ChEBML_201720
IC50 13±n/a nM
Citation Scherz, MWFialeix, MFischer, JBReddy, NLServer, ACSonders, MSTester, BCWeber, EWong, STKeana, JF Synthesis and structure-activity relationships of N,N'-di-o-tolylguanidine analogues, high-affinity ligands for the haloperidol-sensitive sigma receptor. J Med Chem33:2421-9 (1990) Sigma non-opioid intracellular receptor 1
Name:Sigma non-opioid intracellular receptor 1
Type:Enzyme Catalytic Domain
Mol. Mass.:25124.85
Organism:Homo sapiens (Human)
Description:Q99720
Residue:223
BDBM50010764
NameBDBM50010764
Synonyms:CHEMBL543597 | N-Adamantan-1-yl-N'-cyclohexyl-guanidine; hydrochloride
TypeSmall organic molecule
Emp. Form.C17H29N3
Mol. Mass.275.4323
SMILESNC(NC1CCCCC1)=NC12CC3CC(CC(C3)C1)C2