Reaction Details
TargetSigma non-opioid intracellular receptor 1
LigandBDBM50010765
Substrate/Competitorn/a
Meas. Tech.ChEMBL_201265 (CHEMBL873129)
IC50 20.0±n/a nM
Citation Scherz, MWFialeix, MFischer, JBReddy, NLServer, ACSonders, MSTester, BCWeber, EWong, STKeana, JF Synthesis and structure-activity relationships of N,N'-di-o-tolylguanidine analogues, high-affinity ligands for the haloperidol-sensitive sigma receptor. J Med Chem33:2421-9 (1990) Sigma non-opioid intracellular receptor 1
Name:Sigma non-opioid intracellular receptor 1
Type:Enzyme Catalytic Domain
Mol. Mass.:25124.85
Organism:Homo sapiens (Human)
Description:Q99720
Residue:223
BDBM50010765
NameBDBM50010765
Synonyms:CHEMBL78488 | N-Adamantan-1-yl-N'-(2-nitro-phenyl)-guanidine
TypeSmall organic molecule
Emp. Form.C17H22N4O2
Mol. Mass.314.3822
SMILESN\C([N-]C12CC3CC(CC(C3)C1)C2)=[NH+]/c1ccccc1[N+]([O-])=O