Reaction Details
TargetSigma non-opioid intracellular receptor 1
LigandBDBM50010746
Substrate/Competitorn/a
Meas. Tech.ChEBML_201720
IC50 21±n/a nM
Citation Scherz, MWFialeix, MFischer, JBReddy, NLServer, ACSonders, MSTester, BCWeber, EWong, STKeana, JF Synthesis and structure-activity relationships of N,N'-di-o-tolylguanidine analogues, high-affinity ligands for the haloperidol-sensitive sigma receptor. J Med Chem33:2421-9 (1990) Sigma non-opioid intracellular receptor 1
Name:Sigma non-opioid intracellular receptor 1
Type:Enzyme Catalytic Domain
Mol. Mass.:25124.85
Organism:Homo sapiens (Human)
Description:Q99720
Residue:223
BDBM50010746
NameBDBM50010746
Synonyms:CHEMBL79186 | N-(2-Iodo-phenyl)-N'-o-tolyl-guanidine
TypeSmall organic molecule
Emp. Form.C14H14IN3
Mol. Mass.351.1855
SMILESCc1ccccc1N=C(N)Nc1ccccc1I