Reaction Details
TargetSigma non-opioid intracellular receptor 1
LigandBDBM50010801
Substrate/Competitorn/a
Meas. Tech.ChEBML_201720
IC50 25±n/a nM
Citation Scherz, MWFialeix, MFischer, JBReddy, NLServer, ACSonders, MSTester, BCWeber, EWong, STKeana, JF Synthesis and structure-activity relationships of N,N'-di-o-tolylguanidine analogues, high-affinity ligands for the haloperidol-sensitive sigma receptor. J Med Chem33:2421-9 (1990) Sigma non-opioid intracellular receptor 1
Name:Sigma non-opioid intracellular receptor 1
Type:Enzyme Catalytic Domain
Mol. Mass.:25124.85
Organism:Homo sapiens (Human)
Description:Q99720
Residue:223
BDBM50010801
NameBDBM50010801
Synonyms:CHEMBL79665 | N-o-Tolyl-N'-(1,7,7-trimethyl-bicyclo[2.2.1]hept-2-yl)-guanidine
TypeSmall organic molecule
Emp. Form.C18H27N3
Mol. Mass.285.4271
SMILESCc1ccccc1NC(N)=NC1CC2CCC1(C)C2(C)C