Reaction Details
TargetSigma non-opioid intracellular receptor 1
LigandBDBM50010802
Substrate/Competitorn/a
Meas. Tech.ChEBML_201720
IC50 22±n/a nM
Citation Scherz, MWFialeix, MFischer, JBReddy, NLServer, ACSonders, MSTester, BCWeber, EWong, STKeana, JF Synthesis and structure-activity relationships of N,N'-di-o-tolylguanidine analogues, high-affinity ligands for the haloperidol-sensitive sigma receptor. J Med Chem33:2421-9 (1990) Sigma non-opioid intracellular receptor 1
Name:Sigma non-opioid intracellular receptor 1
Type:Enzyme Catalytic Domain
Mol. Mass.:25124.85
Organism:Homo sapiens (Human)
Description:Q99720
Residue:223
BDBM50010802
NameBDBM50010802
Synonyms:CHEMBL554972 | N,N'-Bis-bicyclo[2.2.1]hept-2-yl-guanidine; hydrobromide
TypeSmall organic molecule
Emp. Form.C15H25N3
Mol. Mass.247.3791
SMILESNC(NC1CC2CCC1C2)=NC1CC2CCC1C2