Reaction Details
TargetDelta-type opioid receptor/Kappa-type opioid receptor/Mu-type opioid receptor/Sigma non-opioid intracellular receptor 1
LigandBDBM50013849
Substrate/Competitorn/a
Meas. Tech.ChEMBL_147645 (CHEMBL757329)
Ki 0.500000±n/a nM
Citation Galzi, JLMejean, AIlien, BMollereau, CMeunier, JCGoeldner, MHirth, C Photoactivatable opiate derivatives as irreversible probes of the mu-opioid receptor. J Med Chem33:2456-64 (1990) Delta-type opioid receptor/Kappa-type opioid receptor/Mu-type opioid receptor/Sigma non-opioid intracellular receptor 1
Name:Delta-type opioid receptor/Kappa-type opioid receptor/Mu-type opioid receptor/Sigma non-opioid intracellular receptor 1
Synonyms:Opioid receptor
Type:n/a
Mol. Mass.:n/a
Description:ASSAY_ID of ChEMBL is 172778
Components:This complex has 4 components.
Component 1
Name:Mu-type opioid receptor
Type:G Protein-Coupled Receptor (GPCR)
Mol. Mass.:44503.11
Organism:Rattus norvegicus (rat)
Description:Competition binding assays were carried out using membrane preparations from transfected HN9.10 cells that constitutively expressed the mu opioid receptor.
Residue:398
Component 2
Name:Sigma non-opioid intracellular receptor 1
Synonyms:Opioid receptor SGMR1_RAT Sigma non-opioid intracellular receptor 1 Sigma-1 | Sigmar1
Type:Enzyme Catalytic Domain
Mol. Mass.:25266.54
Organism:RAT
Description:Q9R0C9
Residue:223
Component 3
Name:Kappa-type opioid receptor
Synonyms:KOR-1 OPIATE Kappa Opioid receptor Ror-d
Type:G Protein-Coupled Receptor (GPCR)
Mol. Mass.:42692.90
Organism:Rattus norvegicus (rat)
Description:P34975
Residue:380
Component 4
Name:Delta-type opioid receptor
Synonyms:Cytochrome P450 3A4 Delta opioid receptor Delta-type opioid receptor (DOR) OPRD_RAT Opioid receptor Opioid receptors; mu & delta Ror-a | Voltage-gated potassium channel
Type:G Protein-Coupled Receptor (GPCR)
Mol. Mass.:40465.04
Organism:Rattus norvegicus (rat)
Description:Competition binding assays were using CHO-K1 cell membranes expressing the opioid receptor.
Residue:372
BDBM50013849
NameBDBM50013849
Synonyms:14-[4-azido(methyl)anilino]-4-cyclopropylmethyl-12-oxa-4-azapentacyclo[9.6.1.01,13.05,17.07,18]octadeca-7(18),8,10-triene-10,17-diol(azidonaltrexone) | CHEMBL314209
TypeSmall organic molecule
Emp. Form.C27H31N5O3
Mol. Mass.473.5667
SMILESCN(C1CCC2(O)C3Cc4ccc(O)c5OC1C2(CCN3CC1CC1)c45)c1ccc(cc1)N=[N+]=[N-]