Reaction Details
TargetDelta-type opioid receptor
LigandBDBM50013852
Substrate/Competitorn/a
Meas. Tech.ChEBML_145688
Ki>10000±n/a nM
Citation Galzi, JLMejean, AIlien, BMollereau, CMeunier, JCGoeldner, MHirth, C Photoactivatable opiate derivatives as irreversible probes of the mu-opioid receptor. J Med Chem33:2456-64 (1990) Delta-type opioid receptor
Name:Delta-type opioid receptor
Type:G Protein-Coupled Receptor (GPCR)
Mol. Mass.:40465.04
Organism:Rattus norvegicus (rat)
Description:Competition binding assays were using CHO-K1 cell membranes expressing the opioid receptor.
Residue:372
BDBM50013852
NameBDBM50013852
Synonyms:1-(2-Diethylamino-ethyl)-2-(4-ethoxy-benzyl)-1H-benzoimidazole-5-diazonium | CHEMBL81465
TypeSmall organic molecule
Emp. Form.C22H28N5O
Mol. Mass.378.4901
SMILESCCOc1ccc(Cc2nc3cc(ccc3n2CCN(CC)CC)[N+]#N)cc1