Reaction Details
TargetMu-type opioid receptor
LigandBDBM50013856
Substrate/Competitorn/a
Meas. Tech.ChEBML_149141
Ki 45±n/a nM
Citation Galzi, JLMejean, AIlien, BMollereau, CMeunier, JCGoeldner, MHirth, C Photoactivatable opiate derivatives as irreversible probes of the mu-opioid receptor. J Med Chem33:2456-64 (1990) Mu-type opioid receptor
Name:Mu-type opioid receptor
Type:G Protein-Coupled Receptor (GPCR)
Mol. Mass.:44503.11
Organism:Rattus norvegicus (rat)
Description:Competition binding assays were carried out using membrane preparations from transfected HN9.10 cells that constitutively expressed the mu opioid receptor.
Residue:398
BDBM50013856
NameBDBM50013856
Synonyms:1-[2-(4-Azido-3-iodo-phenyl)-ethyl]-4-(phenyl-propionyl-amino)-piperidine-4-carboxylic acid methyl ester | CHEMBL309542
TypeSmall organic molecule
Emp. Form.C24H28IN5O3
Mol. Mass.561.4153
SMILESCCC(=O)N(c1ccccc1)C1(CCN(CCc2ccc(N=[N+]=[N-])c(I)c2)CC1)C(=O)OC