Reaction Details
TargetMuscarinic acetylcholine receptor M1
LigandBDBM50450592
Substrate/Competitorn/a
Meas. Tech.ChEBML_139068
Ki 0.150000±n/a nM
Citation Hudkins, RLDeHaven-Hudkins, DLStubbins, JF Muscarinic receptor binding profile of para-substituted caramiphen analogues. J Med Chem34:2984-9 (1991) Muscarinic acetylcholine receptor M1
Name:Muscarinic acetylcholine receptor M1
Type:Enzyme Catalytic Domain
Mol. Mass.:51390.46
Organism:RAT
Description:P08482
Residue:460
BDBM50450592
NameBDBM50450592
Synonyms:CHEMBL558910
TypeSmall organic molecule
Emp. Form.C21H23NO3
Mol. Mass.337.4122
SMILESOC(C(=O)O[C@H]1CN2CCC1CC2)(c1ccccc1)c1ccccc1