Reaction Details
TargetMuscarinic acetylcholine receptor M2
LigandBDBM50010097
Substrate/Competitorn/a
Meas. Tech.ChEBML_140189
Ki 390±n/a nM
Citation Hudkins, RLDeHaven-Hudkins, DLStubbins, JF Muscarinic receptor binding profile of para-substituted caramiphen analogues. J Med Chem34:2984-9 (1991) Muscarinic acetylcholine receptor M2
Name:Muscarinic acetylcholine receptor M2
Type:Enzyme Catalytic Domain
Mol. Mass.:51555.53
Organism:RAT
Description:P10980
Residue:466
BDBM50010097
NameBDBM50010097
Synonyms:1-(4-Nitro-phenyl)-cyclopentanecarboxylic acid 2-diethylamino-ethyl ester; hydrochloride | CHEMBL543382
TypeSmall organic molecule
Emp. Form.C18H26N2O4
Mol. Mass.334.41
SMILESCCN(CC)CCOC(=O)C1(CCCC1)c1ccc(cc1)[N+]([O-])=O