Reaction Details
TargetMuscarinic acetylcholine receptor M1
LigandBDBM50368150
Substrate/Competitorn/a
Meas. Tech.ChEBML_139202
Ki 4.8±n/a nM
Citation Triggle, DJKwon, YWAbraham, PPitner, JBMascarella, SWCarroll, FI Synthesis, molecular modeling studies, and muscarinic receptor activity of azaprophen analogues. J Med Chem34:3164-71 (1991) Muscarinic acetylcholine receptor M1
Name:Muscarinic acetylcholine receptor M1
Type:Enzyme Catalytic Domain
Mol. Mass.:51390.46
Organism:RAT
Description:P08482
Residue:460
BDBM50368150
NameBDBM50368150
Synonyms:CHEMBL326640
TypeSmall organic molecule
Emp. Form.C22H25NO2
Mol. Mass.335.4394
SMILESCN1CC2CC1CC(C2)OC(=O)C(c1ccccc1)c1ccccc1