Reaction Details
TargetGlutathione S-transferase theta-1
LigandBDBM50368152
Substrate/Competitorn/a
Meas. Tech.ChEBML_138979
Ki 0.680000±n/a nM
Citation Triggle, DJKwon, YWAbraham, PPitner, JBMascarella, SWCarroll, FI Synthesis, molecular modeling studies, and muscarinic receptor activity of azaprophen analogues. J Med Chem34:3164-71 (1991) Glutathione S-transferase theta-1
Name:Glutathione S-transferase theta-1
Type:PROTEIN
Mol. Mass.:27472.53
Organism:Rattus norvegicus
Description:ChEMBL_138979
Residue:240
BDBM50368152
NameBDBM50368152
Synonyms:CHEMBL318812
TypeSmall organic molecule
Emp. Form.C22H25NO3
Mol. Mass.351.4388
SMILESCN1CC2CC1CC(C2)OC(=O)C(O)(c1ccccc1)c1ccccc1