Reaction Details
TargetMuscarinic acetylcholine receptor M3
LigandBDBM50368152
Substrate/Competitorn/a
Meas. Tech.ChEBML_138980
Ki 1.1±n/a nM
Citation Triggle, DJKwon, YWAbraham, PPitner, JBMascarella, SWCarroll, FI Synthesis, molecular modeling studies, and muscarinic receptor activity of azaprophen analogues. J Med Chem34:3164-71 (1991) Muscarinic acetylcholine receptor M3
Name:Muscarinic acetylcholine receptor M3
Type:Enzyme Catalytic Domain
Mol. Mass.:66086.66
Organism:RAT
Description:Cholinergic, muscarinic M3 CHRM3 RAT::P08483
Residue:589
BDBM50368152
NameBDBM50368152
Synonyms:CHEMBL318812
TypeSmall organic molecule
Emp. Form.C22H25NO3
Mol. Mass.351.4388
SMILESCN1CC2CC1CC(C2)OC(=O)C(O)(c1ccccc1)c1ccccc1