Reaction Details
TargetAldo-keto reductase family 1 member B1
LigandBDBM16314
Substrate/Competitorn/a
Meas. Tech.ChEMBL_32104 (CHEMBL644305)
IC50 2±n/a nM
Citation DuPriest, MTGriffin, BWKuzmich, DMcNatt, LG Spiro[fluoreneisothiazolidin]one dioxides: new aldose reductase and L-hexonate dehydrogenase inhibitors. J Med Chem34:3229-34 (1991) Aldo-keto reductase family 1 member B1
Name:Aldo-keto reductase family 1 member B1
Type:PROTEIN
Mol. Mass.:35797.87
Organism:Rattus norvegicus
Description:ChEMBL_1512484
Residue:316
BDBM16314
NameBDBM16314
Synonyms:2-{[6-methoxy-5-(trifluoromethyl)naphthalen-1-yl]-N-methylmethanethioamido}acetic acid CHEMBL436 Tolrestat
TypeSmall organic molecule
Emp. Form.C16H14F3NO3S
Mol. Mass.357.347
SMILESCOc1ccc2c(cccc2c1C(F)(F)F)C(=S)N(C)CC(O)=O