Reaction Details
TargetD(2) dopamine receptor
LigandBDBM50453025
Substrate/Competitorn/a
Meas. Tech.ChEMBL_59152 (CHEMBL671033)
Ki 2.1±n/a nM
Citation Bakthavachalam, VBaindur, NMadras, BKNeumeyer, JL Fluorescent probes for dopamine receptors: synthesis and characterization of fluorescein and 7-nitrobenz-2-oxa-1,3-diazol-4-yl conjugates of D-1 and D-2 receptor ligands. J Med Chem34:3235-41 (1991) D(2) dopamine receptor
Name:D(2) dopamine receptor
Type:Cell-surface receptors
Mol. Mass.:50647.10
Organism:Homo sapiens (Human)
Description:P14416
Residue:443
BDBM50453025
NameBDBM50453025
Synonyms:CHEMBL612083
TypeSmall organic molecule
Emp. Form.C21H27NO
Mol. Mass.309.4452
SMILES[H][C@@]1(CCc2c(O)cccc2C1)N(CCC)CCc1ccccc1