Reaction Details
TargetD(1A) dopamine receptor
LigandBDBM50010289
Substrate/Competitorn/a
Meas. Tech.ChEMBL_60185 (CHEMBL872877)
Ki 804±n/a nM
Citation Bakthavachalam, VBaindur, NMadras, BKNeumeyer, JL Fluorescent probes for dopamine receptors: synthesis and characterization of fluorescein and 7-nitrobenz-2-oxa-1,3-diazol-4-yl conjugates of D-1 and D-2 receptor ligands. J Med Chem34:3235-41 (1991) D(1A) dopamine receptor
Name:D(1A) dopamine receptor
Type:Enzyme
Mol. Mass.:49303.43
Organism:Homo sapiens (Human)
Description:P21728
Residue:446
BDBM50010289
NameBDBM50010289
Synonyms:(R)6-(Phenethyl-propyl-amino)-5,6,7,8-tetrahydro-naphthalen-1-ol (S)6-(Phenethyl-propyl-amino)-5,6,7,8-tetrahydro-naphthalen-1-ol CHEMBL109684 | N-0434
TypeSmall organic molecule
Emp. Form.C21H27NO
Mol. Mass.309.4452
SMILESCCCN(CCc1ccccc1)C1CCc2c(O)cccc2C1