Reaction Details
TargetD(2) dopamine receptor
LigandBDBM50010300
Substrate/Competitorn/a
Meas. Tech.ChEBML_59152
Ki 7±n/a nM
Citation Bakthavachalam, VBaindur, NMadras, BKNeumeyer, JL Fluorescent probes for dopamine receptors: synthesis and characterization of fluorescein and 7-nitrobenz-2-oxa-1,3-diazol-4-yl conjugates of D-1 and D-2 receptor ligands. J Med Chem34:3235-41 (1991) D(2) dopamine receptor
Name:D(2) dopamine receptor
Type:Cell-surface receptors
Mol. Mass.:50647.10
Organism:Homo sapiens (Human)
Description:P14416
Residue:443
BDBM50010300
NameBDBM50010300
Synonyms:(RS)3',6'-dihydroxy-5-[4-{2-[5-hydroxy-1,2,3,4-tetrahydro-2-naphthalenyl(propyl)amino]ethyl}anilino(thioxo)methylamino]spiro[1,3-dihydroisobenzofuran-1,9'-(9'H-xanthene)]-3-one | CHEMBL320526
TypeSmall organic molecule
Emp. Form.C42H39N3O6S
Mol. Mass.713.841
SMILESCCCN(CCc1ccc(NC(=S)Nc2ccc3c(c2)C(=O)OC32c3ccc(O)cc3Oc3cc(O)ccc23)cc1)C1CCc2c(O)cccc2C1