Reaction Details
TargetD(2) dopamine receptor
LigandBDBM50010293
Substrate/Competitorn/a
Meas. Tech.ChEMBL_59152 (CHEMBL671033)
Ki 6.8±n/a nM
Citation Bakthavachalam, VBaindur, NMadras, BKNeumeyer, JL Fluorescent probes for dopamine receptors: synthesis and characterization of fluorescein and 7-nitrobenz-2-oxa-1,3-diazol-4-yl conjugates of D-1 and D-2 receptor ligands. J Med Chem34:3235-41 (1991) D(2) dopamine receptor
Name:D(2) dopamine receptor
Type:Cell-surface receptors
Mol. Mass.:50647.10
Organism:Homo sapiens (Human)
Description:P14416
Residue:443
BDBM50010293
NameBDBM50010293
Synonyms:(RS)6-{[2-(4-Amino-phenyl)-ethyl]-propyl-amino}-5,6,7,8-tetrahydro-naphthalen-1-ol | CHEMBL111532
TypeSmall organic molecule
Emp. Form.C21H28N2O
Mol. Mass.324.4598
SMILESCCCN(CCc1ccc(N)cc1)C1CCc2c(O)cccc2C1