Reaction Details
TargetD(2) dopamine receptor
LigandBDBM50004917
Substrate/Competitorn/a
Meas. Tech.ChEMBL_58213 (CHEMBL669943)
Ki 1300±n/a nM
Citation Neumeyer, JLBaindur, NNiznik, HBGuan, HCSeeman, P (+/-)-3-Allyl-6-bromo-7,8-dihydroxy-1-phenyl-2,3,4,5-tetrahydro-1H-3- benzazepin, a new high-affinity D1 dopamine receptor ligand: synthesis and structure-activity relationship. J Med Chem34:3366-71 (1992) D(2) dopamine receptor
Name:D(2) dopamine receptor
Type:Cell-surface receptors
Mol. Mass.:50647.10
Organism:Homo sapiens (Human)
Description:P14416
Residue:443
BDBM50004917
NameBDBM50004917
Synonyms:3-Allyl-6-chloro-1-phenyl-2,3,4,5-tetrahydro-1H-benzo[d]azepine-7,8-diol; hydrobromide(Cl-APB) CHEMBL544115 SKF 82958
TypeSmall organic molecule
Emp. Form.C19H20ClNO2
Mol. Mass.329.821
SMILESOc1cc2C(CN(CC=C)CCc2c(Cl)c1O)c1ccccc1