Reaction Details
TargetAngiotensin-converting enzyme
LigandBDBM50011270
Substrate/Competitorn/a
Meas. Tech.ChEMBL_36005 (CHEMBL644713)
Ki 1.2±n/a nM
Citation Hausin, RJCodding, PW Molecular and crystal structures of MDL27,467A hydrochloride and quinapril hydrochloride, two ester derivatives of potent angiotensin converting enzyme inhibitors. J Med Chem34:511-7 (1991) Angiotensin-converting enzyme
Name:Angiotensin-converting enzyme
Type:Enzyme
Mol. Mass.:149709.01
Organism:Homo sapiens (Human)
Description:n/a
Residue:1306
BDBM50011270
NameBDBM50011270
Synonyms:2-[2-(1-Carboxy-3-phenyl-propylamino)-propionyl]-1,2,3,4-tetrahydro-isoquinoline-3-carboxylic acid(MDL27,088) MDL-27088
TypeSmall organic molecule
Emp. Form.C25H28N2O5
Mol. Mass.436.5002
SMILESOC(=O)C(CCc1ccccc1)NC1Cc2ccccc2[C@H]2CCC[C@H](N2C1=O)C(O)=O