Reaction Details
TargetDihydrofolate reductase
LigandBDBM50367055
Substrate/Competitorn/a
Meas. Tech.ChEBML_54445
IC50 35±n/a nM
Citation Rosowsky, ABader, HFreisheim, JH Synthesis and biological activity of methotrexate analogues with two acid groups and a hydrophobic aromatic ring in the side chain. J Med Chem34:574-9 (1991) Dihydrofolate reductase
Name:Dihydrofolate reductase
Type:Enzyme
Mol. Mass.:21608.82
Organism:Mus musculus (Mouse)
Description:n/a
Residue:187
BDBM50367055
NameBDBM50367055
Synonyms:4-Aminofolic acid AMINOPTERIN | Aminopteroylglutamic acid
TypeSmall organic molecule
Emp. Form.C19H20N8O5
Mol. Mass.440.4127
SMILESNc1nc(N)c2nc(CNc3ccc(cc3)C(=O)N[C@@H](CCC(O)=O)C(O)=O)cnc2n1