Reaction Details
TargetAdenosine receptor A1
LigandBDBM50453037
Substrate/Competitorn/a
Meas. Tech.ChEMBL_29172 (CHEMBL637903)
Ki 48±n/a nM
Citation Trivedi, BKBlankley, CJBristol, JAHamilton, HWPatt, WCKramer, WJJohnson, SABruns, RFCohen, DMRyan, MJ N6-substituted adenosine receptor agonists: potential antihypertensive agents. J Med Chem34:1043-9 (1991) Adenosine receptor A1
Name:Adenosine receptor A1
Type:Protein
Mol. Mass.:36704.13
Organism:Rattus norvegicus (rat)
Description:n/a
Residue:326
BDBM50453037
NameBDBM50453037
Synonyms:CHEMBL2092767
TypeSmall organic molecule
Emp. Form.C23H29N5O5
Mol. Mass.455.5069
SMILESCCCCOc1ccc2C(CCc2c1)Nc1ncnc2n(cnc12)[C@@H]1O[C@H](CO)[C@@H](O)[C@H]1O