Reaction Details
TargetAdenosine receptor A1
LigandBDBM50229184
Substrate/Competitorn/a
Meas. Tech.ChEMBL_29172 (CHEMBL637903)
Ki 23±n/a nM
Citation Trivedi, BKBlankley, CJBristol, JAHamilton, HWPatt, WCKramer, WJJohnson, SABruns, RFCohen, DMRyan, MJ N6-substituted adenosine receptor agonists: potential antihypertensive agents. J Med Chem34:1043-9 (1991) Adenosine receptor A1
Name:Adenosine receptor A1
Type:Protein
Mol. Mass.:36704.13
Organism:Rattus norvegicus (rat)
Description:n/a
Residue:326
BDBM50229184
NameBDBM50229184
Synonyms:CHEMBL2236003
TypeSmall organic molecule
Emp. Form.C20H23N5O4
Mol. Mass.397.4277
SMILESOC[C@H]1O[C@H]([C@H](O)[C@@H]1O)n1cnc2c(N[C@@H]3CCCc4ccccc34)ncnc12