Reaction Details
TargetAdenosine receptor A2a/A2b
LigandBDBM50453037
Substrate/Competitorn/a
Meas. Tech.ChEMBL_30710 (CHEMBL645453)
Ki 3946±n/a nM
Citation Trivedi, BKBlankley, CJBristol, JAHamilton, HWPatt, WCKramer, WJJohnson, SABruns, RFCohen, DMRyan, MJ N6-substituted adenosine receptor agonists: potential antihypertensive agents. J Med Chem34:1043-9 (1991) Adenosine receptor A2a/A2b
Name:Adenosine receptor A2a/A2b
Synonyms:Adenosine A2 receptor
Type:n/a
Mol. Mass.:n/a
Description:ASSAY_ID of ChEMBL is 30560
Components:This complex has 2 components.
Component 1
Name:Adenosine receptor A2b
Type:PROTEIN
Mol. Mass.:36378.84
Organism:Rattus norvegicus
Description:ChEMBL_32934
Residue:332
Component 2
Name:Adenosine receptor A2a
Synonyms:AA2AR_RAT Adenosine A2 receptor Adenosine Receptors A2a (A2a) Adenosine receptors A2a Rat striatal adenosine A2a receptor
Type:G Protein-Coupled Receptor (GPCR)
Mol. Mass.:45015.65
Organism:Rattus norvegicus (rat)
Description:Rat A2A receptors expressed in CHO cells.
Residue:410
BDBM50453037
NameBDBM50453037
Synonyms:CHEMBL2092767
TypeSmall organic molecule
Emp. Form.C23H29N5O5
Mol. Mass.455.5069
SMILESCCCCOc1ccc2C(CCc2c1)Nc1ncnc2n(cnc12)[C@@H]1O[C@H](CO)[C@@H](O)[C@H]1O