Reaction Details
TargetAdenosine receptor A1
LigandBDBM50368192
Substrate/Competitorn/a
Meas. Tech.ChEBML_29172
Ki 5±n/a nM
Citation Trivedi, BKBlankley, CJBristol, JAHamilton, HWPatt, WCKramer, WJJohnson, SABruns, RFCohen, DMRyan, MJ N6-substituted adenosine receptor agonists: potential antihypertensive agents. J Med Chem34:1043-9 (1991) Adenosine receptor A1
Name:Adenosine receptor A1
Type:Protein
Mol. Mass.:36704.13
Organism:Rattus norvegicus (rat)
Description:n/a
Residue:326
BDBM50368192
NameBDBM50368192
Synonyms:CHEMBL2235605 | CHEMBL604358
TypeSmall organic molecule
Emp. Form.C21H25N5O6
Mol. Mass.443.4531
SMILESCOc1cc2CC(Cc2cc1OC)Nc1ncnc2n(cnc12)[C@@H]1O[C@H](CO)[C@@H](O)[C@H]1O