Reaction Details
TargetAdenosine receptor A1
LigandBDBM50368206
Substrate/Competitorn/a
Meas. Tech.ChEBML_29172
Ki 88±n/a nM
Citation Trivedi, BKBlankley, CJBristol, JAHamilton, HWPatt, WCKramer, WJJohnson, SABruns, RFCohen, DMRyan, MJ N6-substituted adenosine receptor agonists: potential antihypertensive agents. J Med Chem34:1043-9 (1991) Adenosine receptor A1
Name:Adenosine receptor A1
Type:Protein
Mol. Mass.:36704.13
Organism:Rattus norvegicus (rat)
Description:n/a
Residue:326
BDBM50368206
NameBDBM50368206
Synonyms:CHEMBL2235585 | CHEMBL603927
TypeSmall organic molecule
Emp. Form.C23H29N5O5
Mol. Mass.455.5069
SMILESCC(C)Oc1cccc2C(CCCc12)Nc1ncnc2n(cnc12)[C@@H]1O[C@H](CO)[C@@H](O)[C@H]1O