Reaction Details
TargetAdenosine receptor A1
LigandBDBM50368207
Substrate/Competitorn/a
Meas. Tech.ChEBML_29172
Ki 32±n/a nM
Citation Trivedi, BKBlankley, CJBristol, JAHamilton, HWPatt, WCKramer, WJJohnson, SABruns, RFCohen, DMRyan, MJ N6-substituted adenosine receptor agonists: potential antihypertensive agents. J Med Chem34:1043-9 (1991) Adenosine receptor A1
Name:Adenosine receptor A1
Type:Protein
Mol. Mass.:36704.13
Organism:Rattus norvegicus (rat)
Description:n/a
Residue:326
BDBM50368207
NameBDBM50368207
Synonyms:CHEMBL605165
TypeSmall organic molecule
Emp. Form.C20H21N5O4
Mol. Mass.395.4118
SMILESOC[C@H]1OC([C@H](O)[C@@H]1O)n1cnc2c(NCC3=CCc4ccccc34)ncnc12