Reaction Details
TargetAdenosine receptor A1
LigandBDBM50368188
Substrate/Competitorn/a
Meas. Tech.ChEBML_29172
Ki 64±n/a nM
Citation Trivedi, BKBlankley, CJBristol, JAHamilton, HWPatt, WCKramer, WJJohnson, SABruns, RFCohen, DMRyan, MJ N6-substituted adenosine receptor agonists: potential antihypertensive agents. J Med Chem34:1043-9 (1991) Adenosine receptor A1
Name:Adenosine receptor A1
Type:Protein
Mol. Mass.:36704.13
Organism:Rattus norvegicus (rat)
Description:n/a
Residue:326
BDBM50368188
NameBDBM50368188
Synonyms:CHEMBL2235594 | CHEMBL603398
TypeSmall organic molecule
Emp. Form.C19H21N5O5
Mol. Mass.399.4005
SMILESOC[C@H]1O[C@H]([C@H](O)[C@@H]1O)n1cnc2c(NC3CCOc4ccccc34)ncnc12