Reaction Details
TargetAdenosine receptor A1
LigandBDBM50368211
Substrate/Competitorn/a
Meas. Tech.ChEBML_29172
Ki 20±n/a nM
Citation Trivedi, BKBlankley, CJBristol, JAHamilton, HWPatt, WCKramer, WJJohnson, SABruns, RFCohen, DMRyan, MJ N6-substituted adenosine receptor agonists: potential antihypertensive agents. J Med Chem34:1043-9 (1991) Adenosine receptor A1
Name:Adenosine receptor A1
Type:Protein
Mol. Mass.:36704.13
Organism:Rattus norvegicus (rat)
Description:n/a
Residue:326
BDBM50368211
NameBDBM50368211
Synonyms:CHEMBL2236011 | CHEMBL604145
TypeSmall organic molecule
Emp. Form.C20H23N5O5
Mol. Mass.413.4271
SMILESOC[C@H]1O[C@H]([C@H](O)[C@@H]1O)n1cnc2c(NC3CCCc4c(O)cccc34)ncnc12