Reaction Details
TargetAdenosine receptor A1
LigandBDBM50368214
Substrate/Competitorn/a
Meas. Tech.ChEBML_29172
Ki 61±n/a nM
Citation Trivedi, BKBlankley, CJBristol, JAHamilton, HWPatt, WCKramer, WJJohnson, SABruns, RFCohen, DMRyan, MJ N6-substituted adenosine receptor agonists: potential antihypertensive agents. J Med Chem34:1043-9 (1991) Adenosine receptor A1
Name:Adenosine receptor A1
Type:Protein
Mol. Mass.:36704.13
Organism:Rattus norvegicus (rat)
Description:n/a
Residue:326
BDBM50368214
NameBDBM50368214
Synonyms:CHEMBL604144
TypeSmall organic molecule
Emp. Form.C21H25N5O5
Mol. Mass.427.4537
SMILESOC[C@H]1OC([C@H](O)[C@@H]1O)n1cnc2c(NCC3(O)CCCc4ccccc34)ncnc12