Reaction Details
TargetMu-type opioid receptor
LigandBDBM50009127
Substrate/Competitorn/a
Meas. Tech.ChEBML_145153
Ki 189±n/a nM
Citation Portoghese, PSGarzon-Aburbeh, ANagase, HLin, CETakemori, AE Role of the spacer in conferring kappa opioid receptor selectivity to bivalent ligands related to norbinaltorphimine. J Med Chem34:1292-6 (1991) Mu-type opioid receptor
Name:Mu-type opioid receptor
Type:Enzyme Catalytic Domain
Mol. Mass.:11165.58
Organism:GUINEA PIG
Description:P97266
Residue:98
BDBM50009127
NameBDBM50009127
Synonyms:bis(4-cyclopropylmethyl-12-oxa-4-azapentacyclo[9.6.1.01,13.05,17.07,18]octadeca-7(18),8,10,14-tetraene-10,17-diol)thiphene
TypeSmall organic molecule
Emp. Form.C40H42N2O6S
Mol. Mass.678.836
SMILESOc1ccc2CC3N(CC4CC4)CC[C@@]45[C@@H](Oc1c24)c1sc2[C@@H]4Oc6c7c(CC8N(CC9CC9)CC[C@@]47[C@@]8(O)Cc2c1C[C@@]35O)ccc6O