Reaction Details
TargetAdenosine receptor A1
LigandBDBM21220
Substrate/Competitorn/a
Meas. Tech.ChEMBL_29276 (CHEMBL640337)
EC50 6.31E1±n/a nM
Citation Ueeda, MThompson, RDArroyo, LHOlsson, RA 2-Alkoxyadenosines: potent and selective agonists at the coronary artery A2 adenosine receptor. J Med Chem34:1334-9 (1991) Adenosine receptor A1
Name:Adenosine receptor A1
Type:Enzyme Catalytic Domain
Mol. Mass.:36501.39
Organism:GUINEA PIG
Description:ADENOSINE A1 ADORA1 GUINEA PIG::P47745
Residue:326
BDBM21220
NameBDBM21220
Synonyms:(2S,3S,4R,5R)-5-(6-amino-9H-purin-9-yl)-N-ethyl-3,4-dihydroxyoxolane-2-carboxamide Adenosine, N6-Ethyl-carboxamido CHEMBL464859 NECA
TypeAntineoplastic Agent
Emp. Form.C12H16N6O4
Mol. Mass.308.2932
SMILESCCNC(=O)[C@H]1O[C@H]([C@H](O)[C@@H]1O)n1cnc2c(N)ncnc12