Reaction Details
TargetDelta-type opioid receptor
LigandBDBM50009144
Substrate/Competitorn/a
Meas. Tech.ChEBML_147051
Ki 0.200000±n/a nM
Citation Lazarus, LHSalvadori, SSantagada, VTomatis, RWilson, WE Function of negative charge in the"address domain" of deltorphins. J Med Chem34:1350-5 (1991) Delta-type opioid receptor
Name:Delta-type opioid receptor
Type:G Protein-Coupled Receptor (GPCR)
Mol. Mass.:40465.04
Organism:Rattus norvegicus (rat)
Description:Competition binding assays were using CHO-K1 cell membranes expressing the opioid receptor.
Residue:372
BDBM50009144
NameBDBM50009144
Synonyms:(2-{2-[2-(2-{2-[2-Amino-3-(4-hydroxy-phenyl)-propionylamino]-propionylamino}-3-phenyl-propionylamino)-4-carbamoyl-butyrylamino]-3-methyl-butyrylamino}-3-methyl-butyrylamino)-acetic acid | CHEMBL28401
TypeSmall organic molecule
Emp. Form.C38H54N8O10
Mol. Mass.782.883
SMILESCC(C)[C@H](NC(=O)[C@@H](NC(=O)[C@H](CCC(N)=O)NC(=O)[C@H](Cc1ccccc1)NC(=O)[C@@H](C)NC(=O)[C@@H](N)Cc1ccc(O)cc1)C(C)C)C(=O)NCC(O)=O