Reaction Details
TargetMu-type opioid receptor
LigandBDBM50009222
Substrate/Competitorn/a
Meas. Tech.ChEBML_146263
Ki 0.630±n/a nM
Citation Portoghese, PSNagase, HMaloneyHuss, KELin, CETakemori, AE Role of spacer and address components in peptidomimetic delta opioid receptor antagonists related to naltrindole. J Med Chem34:1715-20 (1991) Mu-type opioid receptor
Name:Mu-type opioid receptor
Type:Enzyme Catalytic Domain
Mol. Mass.:11165.58
Organism:GUINEA PIG
Description:P97266
Residue:98
BDBM50009222
NameBDBM50009222
Synonyms:4-cyclopropylmethyl-14-(1H-3-indolyl)-(1S,13S,17S)-12-oxa-4-azapentacyclo[9.6.1.01,13.05,17.07,18]octadeca-7(18),8,10,14-tetraene-10,17-diol
TypeSmall organic molecule
Emp. Form.C28H28N2O3
Mol. Mass.440.5335
SMILESOc1ccc2CC3N(CC4CC4)CC[C@@]45[C@@H](Oc1c24)C(=CC[C@@]35O)c1c[nH]c2ccccc12