Reaction Details
TargetDelta-type opioid receptor
LigandBDBM82552
Substrate/Competitorn/a
Meas. Tech.ChEMBL_146443 (CHEMBL756425)
Ki 0.013±n/a nM
Citation Portoghese, PSNagase, HMaloneyHuss, KELin, CETakemori, AE Role of spacer and address components in peptidomimetic delta opioid receptor antagonists related to naltrindole. J Med Chem34:1715-20 (1991) Delta-type opioid receptor
Name:Delta-type opioid receptor
Type:G Protein-Coupled Receptor (GPCR)
Mol. Mass.:40382.98
Organism:Homo sapiens (Human)
Description:Competition binding assays were carried out using membrane preparations from transfected HN9.10 cells that constitutively expressed the delta opioid receptor.
Residue:372
BDBM82552
NameBDBM82552
Synonyms:CAS_111555-58-9 naltrindolebenzofuran
TypeSmall organic molecule
Emp. Form.C26H25NO4
Mol. Mass.415.481
SMILESOc1ccc2C[C@H]3N(CC4CC4)CC[C@@]45[C@@H](Oc1c24)c1oc2ccccc2c1C[C@@]35O