Reaction Details
TargetCarbonic anhydrase 2
LigandBDBM50012208
Substrate/Competitorn/a
Meas. Tech.ChEMBL_45238 (CHEMBL658941)
Ki 1.54±n/a nM
Citation Prugh, JDHartman, GDMallorga, PJMcKeever, BMMichelson, SRMurcko, MASchwam, HSmith, RLSondey, JMSpringer, JP New isomeric classes of topically active ocular hypotensive carbonic anhydrase inhibitors: 5-substituted thieno[2,3-b]thiophene-2-sulfonamides and 5-substituted thieno[3,2-b]thiophene-2-sulfonamides. J Med Chem34:1805-18 (1991) Carbonic anhydrase 2
Name:Carbonic anhydrase 2
Type:Enzyme
Mol. Mass.:29250.71
Organism:Homo sapiens (Human)
Description:P00918
Residue:260
BDBM50012208
NameBDBM50012208
Synonyms:5-{1-[[2-(2-Methoxy-ethoxy)-ethyl]-(2-methoxy-ethyl)-amino]-ethyl}-thieno[2,3-b]thiophene-2-sulfonic acid amide; hydrochloride | CHEMBL543319
TypeSmall organic molecule
Emp. Form.C16H26N2O5S3
Mol. Mass.422.583
SMILESCOCCOCCN(CCOC)C(C)c1cc2cc(sc2s1)S(N)(=O)=O