Reaction Details
TargetCarbonic anhydrase 2
LigandBDBM50012210
Substrate/Competitorn/a
Meas. Tech.ChEMBL_45238 (CHEMBL658941)
Ki 3.40±n/a nM
Citation Prugh, JDHartman, GDMallorga, PJMcKeever, BMMichelson, SRMurcko, MASchwam, HSmith, RLSondey, JMSpringer, JP New isomeric classes of topically active ocular hypotensive carbonic anhydrase inhibitors: 5-substituted thieno[2,3-b]thiophene-2-sulfonamides and 5-substituted thieno[3,2-b]thiophene-2-sulfonamides. J Med Chem34:1805-18 (1991) Carbonic anhydrase 2
Name:Carbonic anhydrase 2
Type:Enzyme
Mol. Mass.:29250.71
Organism:Homo sapiens (Human)
Description:P00918
Residue:260
BDBM50012210
NameBDBM50012210
Synonyms:5-Sulfamoyl-thieno[2,3-b]thiophene-2-carboxylic acid (2,3-dihydroxy-propyl)-amide | CHEMBL51975
TypeSmall organic molecule
Emp. Form.C10H12N2O5S3
Mol. Mass.336.408
SMILESNS(=O)(=O)c1cc2cc(sc2s1)C(=O)NCC(O)CO