Reaction Details
TargetCarbonic anhydrase 2
LigandBDBM50012224
Substrate/Competitorn/a
Meas. Tech.ChEMBL_45237 (CHEMBL658940)
Ki 4.8±n/a nM
Citation Prugh, JDHartman, GDMallorga, PJMcKeever, BMMichelson, SRMurcko, MASchwam, HSmith, RLSondey, JMSpringer, JP New isomeric classes of topically active ocular hypotensive carbonic anhydrase inhibitors: 5-substituted thieno[2,3-b]thiophene-2-sulfonamides and 5-substituted thieno[3,2-b]thiophene-2-sulfonamides. J Med Chem34:1805-18 (1991) Carbonic anhydrase 2
Name:Carbonic anhydrase 2
Type:Enzyme
Mol. Mass.:29250.71
Organism:Homo sapiens (Human)
Description:P00918
Residue:260
BDBM50012224
NameBDBM50012224
Synonyms:5-[(2-Methanesulfonyl-ethylamino)-methyl]-thieno[2,3-b]thiophene-2-sulfonic acid amide; hydrochloride | CHEMBL539258
TypeSmall organic molecule
Emp. Form.C10H14N2O4S4
Mol. Mass.354.489
SMILESCS(=O)(=O)CCNCc1cc2cc(sc2s1)S(N)(=O)=O