Reaction Details
TargetGag-Pol polyprotein [489-587]
LigandBDBM50009242
Substrate/Competitorn/a
Meas. Tech.ChEMBL_159774 (CHEMBL763099)
IC50<0.400000±n/a nM
Citation Huff, JR HIV protease: a novel chemotherapeutic target for AIDS. J Med Chem34:2305-14 (1991) Gag-Pol polyprotein [489-587]
Name:Gag-Pol polyprotein [489-587]
Type:Enzyme Subunit
Mol. Mass.:10781.16
Organism:Human immunodeficiency virus type 1
Description:P04585[489-587]
Residue:99
BDBM50009242
NameBDBM50009242
Synonyms:CHEMBL48565 {1-[1-Benzyl-4-(2-benzyloxycarbonylamino-3-methyl-butyrylamino)-2,3-dihydroxy-5-phenyl-pentylcarbamoyl]-2-methyl-propyl}-carbamic acid benzyl ester
TypeSmall organic molecule
Emp. Form.C44H54N4O8
Mol. Mass.766.9216
SMILESCC(C)[C@H](NC(=O)OCc1ccccc1)C(=O)N[C@@H](Cc1ccccc1)[C@H](O)[C@H](O)[C@H](Cc1ccccc1)NC(=O)[C@@H](NC(=O)OCc1ccccc1)C(C)C