Reaction Details
TargetGenome polyprotein
LigandBDBM50368642
Substrate/Competitorn/a
Meas. Tech.ChEBML_160729
Ki 5.0±n/a nM
Citation Huff, JR HIV protease: a novel chemotherapeutic target for AIDS. J Med Chem34:2305-14 (1991) Genome polyprotein
Name:Genome polyprotein
Type:PROTEIN
Mol. Mass.:44361.04
Organism:Human rhinovirus B
Description:ChEMBL_158953
Residue:401
BDBM50368642
NameBDBM50368642
Synonyms:ACETYLPEPSTATIN
TypeSmall organic molecule
Emp. Form.C31H57N5O9
Mol. Mass.643.8124
SMILESCC(C)C[C@H](NC(=O)[C@H](C)NC(=O)C[C@H](O)[C@H](CC(C)C)NC(=O)[C@@H](NC(=O)[C@@H](NC(C)=O)C(C)C)C(C)C)[C@@H](O)CC(O)=O