Reaction Details
TargetSerotonin 2 (5-HT2) receptor
LigandBDBM50010048
Substrate/Competitorn/a
Meas. Tech.ChEMBL_1940 (CHEMBL617547)
IC50 0.200000±n/a nM
Citation Malleron, JLComte, MTGueremy, CPeyronel, JFTruchon, ABlanchard, JCDoble, APiot, OZundel, JLHuon, C Naphthosultam derivatives: a new class of potent and selective 5-HT2 antagonists. J Med Chem34:2477-83 (1991) Serotonin 2 (5-HT2) receptor
Name:Serotonin 2 (5-HT2) receptor
Synonyms:5-hydroxytryptamine receptor 2A/2B/2C
Type:n/a
Mol. Mass.:n/a
Description:ASSAY_ID of ChEMBL is 2197419
Components:This complex has 3 components.
Component 1
Name:5-hydroxytryptamine receptor 2B
Type:Enzyme Catalytic Domain
Mol. Mass.:53668.47
Organism:RAT
Description:5-HT2B HTR2B RAT::P30994
Residue:479
Component 2
Name:5-hydroxytryptamine receptor 2C
Synonyms:5-HT2C 5-hydroxytryptamine receptor 2C (5HT2c) 5ht1c Htr2c Serotonin receptor 2a and 2c (5HT2A and 5HT2C)
Type:Enzyme
Mol. Mass.:51935.10
Organism:Rattus norvegicus (Rat)
Description:P08909
Residue:460
Component 3
Name:5-hydroxytryptamine receptor 2A
Synonyms:5-HT-2A 5-HT2A 5-hydroxytryptamine receptor 2A (5HT2A) Htr2 Serotonin Receptor 2A
Type:G Protein-Coupled Receptor (GPCR)
Mol. Mass.:52852.05
Organism:Rattus norvegicus (rat)
Description:Rat cortex membranes 5-HT2A receptors.
Residue:471
BDBM50010048
NameBDBM50010048
Synonyms:2-[3-(4-Phenyl-piperidin-1-yl)-propyl]-2H-naphtho[1,8-cd]isothiazole 1,1-dioxide | CHEMBL418929
TypeSmall organic molecule
Emp. Form.C24H26N2O2S
Mol. Mass.406.54
SMILESO=S1(=O)N(CCCN2CCC(CC2)c2ccccc2)c2cccc3cccc1c23