Reaction Details
TargetThermolysin
LigandBDBM50006113
Substrate/Competitorn/a
Meas. Tech.ChEBML_210389
Ki 750±n/a nM
Citation Bohacek, RSMcMartin, C Definition and display of steric, hydrophobic, and hydrogen-bonding properties of ligand binding sites in proteins using Lee and Richards accessible surface: validation of a high-resolution graphical tool for drug design. J Med Chem35:1671-84 (1992) Thermolysin
Name:Thermolysin
Type:PROTEIN
Mol. Mass.:60097.54
Organism:Bacillus thermoproteolyticus
Description:ChEMBL_1468794
Residue:548
BDBM50006113
NameBDBM50006113
Synonyms:(BAG)2-Benzyl-N-[1-(carbamoylmethyl-carbamoyl)-ethyl]-3-mercapto-propionamide | CHEMBL46225
TypeSmall organic molecule
Emp. Form.C15H21N3O3S
Mol. Mass.323.411
SMILESC[C@H](NC(=O)C(CS)Cc1ccccc1)C(=O)NCC(N)=O