Reaction Details
TargetReverse transcriptase/RNaseH
LigandBDBM50002470
Substrate/Competitorn/a
Meas. Tech.ChEBML_195520
Ki 130±n/a nM
Citation Ma, QFBathurst, ICBarr, PJKenyon, GL New thymidine triphosphate analogue inhibitors of human immunodeficiency virus-1 reverse transcriptase. J Med Chem35:1938-41 (1992) Reverse transcriptase/RNaseH
Name:Reverse transcriptase/RNaseH
Type:PROTEIN
Mol. Mass.:65229.15
Organism:Human immunodeficiency virus 1
Description:ChEMBL_1473730
Residue:566
BDBM50002470
NameBDBM50002470
Synonyms:AZTTP3'-azido-3'-deoxythymidine 5'-triphosphate
TypeSmall organic molecule
Emp. Form.C9H10N5O13P3
Mol. Mass.489.1249
SMILESCc1cn([C@H]2C[C@@H](N=[N+]=[N-])[C@@H](OP([O-])(=O)OP([O-])(=O)OP([O-])([O-])=O)O2)c(=O)[nH]c1=O